Discussion:
Smoke [ebcdic] v5.23.7-5-g85b9116 FAIL(X) os/390 24.00 (2964/)
(too old to reply)
Karl Williamson
2016-01-27 06:27:20 UTC
Permalink
Smoke log available at https://drive.google.com/file/d/0B5PTttxwo7qAUW5rTnBOa0JjZm8
Automated smoke report for branch ebcdic 5.23.7 patch 85b9116610a8cdac1245b1967c35100843bf2280
v5.23.7-5-g85b9116
RS12: 2964 (2964/)
on os/390 - 24.00
using c99 version
smoketime 1 day 18 hours 50 minutes (average 21 hours 25 minutes)
Summary: FAIL(X)
Please send me the file lib/unicore/TestProp.pl so I can look at it.

Is the smoke time so long because the main frame is being shared with
other tasks? (I hope it's not because we've somehow slowed everything
down inadvertently).
O = OK F = Failure(s), extended report at the bottom
X = Failure(s) under TEST but not under harness
? = still running or test results not (yet) available
Build failures during: - = unknown or N/A
c = Configure, m = make, M = make (after miniperl), t = make test-prep
v5.23.7-5-g85b9116 Configuration (common) none
----------- ---------------------------------------------------------
X X X X -Dusedl
+----- PERLIO = perlio -DDEBUGGING
+------- PERLIO = stdio -DDEBUGGING
+--------- PERLIO = perlio
+----------- PERLIO = stdio
SMOKE85b9116610a8cdac1245b1967c35100843bf2280
# One test name on a line
Failures: (common-args) none
[stdio/perlio] -Dusedl
[stdio] -DDEBUGGING -Dusedl
../t/re/uniprops.t...................... .................................................
FAILED at test 19
[perlio] -DDEBUGGING -Dusedl
../t/re/uniprops.t...................... .................................................
FAILED at test 19
../t/re/speed.t......................... ....................................................
FAILED--expected 57 tests, saw 38
--
Report by Test::Smoke v1.6 running on perl 5.22.0
(Reporter v0.052 / Smoker v0.045)
--
Regards,
Yaroslav Kuzmin
Developer C/C++ ,z/OS , Linux
3 Zhukovskiy Street · Miass, Chelyabinsk region 456318 · Russia
Tel: +7.922.2.38.33.38
Web: www.rocketsoftware.com
================================
Rocket Software, Inc. and subsidiaries ■ 77 Fourth Avenue, Waltham MA 02451 ■ +1 800.966.3270 ■ +1 781.577.4321
Manage Your Subscription Preferences - http://info.rocketsoftware.com/GlobalSubscriptionManagementEmailFooter_SubscriptionCenter.html
Privacy Policy - http://www.rocketsoftware.com/company/legal/privacy-policy
================================
This communication and any attachments may contain confidential information of Rocket Software, Inc. All unauthorized use, disclosure or distribution is prohibited. If you are not the intended recipient, please notify Rocket Software immediately and destroy all copies of this communication. Thank you.
Karl Williamson
2016-01-29 05:11:41 UTC
Permalink
Smoke log available at https://drive.google.com/file/d/0B5PTttxwo7qAUW5rTnBOa0JjZm8
Well, I hadn't adequately analyzed the situation. A new branch has been
pushed, updated to latest blead, with a different fix, that I think
should work.
Automated smoke report for branch ebcdic 5.23.7 patch 85b9116610a8cdac1245b1967c35100843bf2280
v5.23.7-5-g85b9116
RS12: 2964 (2964/)
on os/390 - 24.00
using c99 version
smoketime 1 day 18 hours 50 minutes (average 21 hours 25 minutes)
Summary: FAIL(X)
O = OK F = Failure(s), extended report at the bottom
X = Failure(s) under TEST but not under harness
? = still running or test results not (yet) available
Build failures during: - = unknown or N/A
c = Configure, m = make, M = make (after miniperl), t = make test-prep
v5.23.7-5-g85b9116 Configuration (common) none
----------- ---------------------------------------------------------
X X X X -Dusedl
+----- PERLIO = perlio -DDEBUGGING
+------- PERLIO = stdio -DDEBUGGING
+--------- PERLIO = perlio
+----------- PERLIO = stdio
SMOKE85b9116610a8cdac1245b1967c35100843bf2280
# One test name on a line
Failures: (common-args) none
[stdio/perlio] -Dusedl
[stdio] -DDEBUGGING -Dusedl
../t/re/uniprops.t...................... .................................................
FAILED at test 19
[perlio] -DDEBUGGING -Dusedl
../t/re/uniprops.t...................... .................................................
FAILED at test 19
../t/re/speed.t......................... ....................................................
FAILED--expected 57 tests, saw 38
--
Report by Test::Smoke v1.6 running on perl 5.22.0
(Reporter v0.052 / Smoker v0.045)
--
Regards,
Yaroslav Kuzmin
Developer C/C++ ,z/OS , Linux
3 Zhukovskiy Street · Miass, Chelyabinsk region 456318 · Russia
Tel: +7.922.2.38.33.38
Web: www.rocketsoftware.com
================================
Rocket Software, Inc. and subsidiaries ■ 77 Fourth Avenue, Waltham MA 02451 ■ +1 800.966.3270 ■ +1 781.577.4321
Manage Your Subscription Preferences - http://info.rocketsoftware.com/GlobalSubscriptionManagementEmailFooter_SubscriptionCenter.html
Privacy Policy - http://www.rocketsoftware.com/company/legal/privacy-policy
================================
This communication and any attachments may contain confidential information of Rocket Software, Inc. All unauthorized use, disclosure or distribution is prohibited. If you are not the intended recipient, please notify Rocket Software immediately and destroy all copies of this communication. Thank you.
Loading...